{"text_format":"1","workbook":"xlsx","n_sheets":10,"sheets":["Datos","Estacion 1","Estacion 2","Estacion 3","Estacion 4","Estacion 5","Estacion 6","Estacion 7","Estacion 8","ParamsANT"],"not_rendered":{"charts":0,"images":3,"macros":1,"external_links":0,"defined_names":0,"comments":0,"pivot_tables":0},"unopened":[],"bounds":{"document_bytes":16777216,"sheet_cells":100000,"rows_first":2000,"rows_last":500,"rows_between":2000,"halvings":0,"cell_chars":16384,"cell_head_chars":4096},"cells_cut":0,"cells_raw":0,"read":"whole","date_system":"1900"}

{"sheet":"Datos","index":0,"n_rows":9,"n_cols":26,"rows_kept":9,"cut":false,"hidden":false,"merged":[]}
["Cto. Gallego O-Precisión 2018, 26/05/2018"]
["Resultados en meta"]
[]
["Categoría: Open"]
[null,null,null,null,null,null,null,null,null,null,null,null,null,null,null,null,null,null,null,null,null,"Grupo-crono1"]
[null,null,null,null,null,null,"Puntos",null,"t max 105",null,null,1,2,3,4,5,6,7,8,9,10,1,2,3,"T.Crono","T.Penal."]
["Posición","Dorsal","Nombre","Club","Puntos","Tiempo","P.Correcto","P.Penal.","T.Carrera (min.)","T.Neutr.","T.Total","B","C","Z","X","Z","Z","X","B","C","Z","D","B","C"]
[1,101,null,null,8,"90.00",8,0,56,0,56,"B","C","Z","B","Z","Z","B","B","C","Z",{"$f":"VLOOKUP($B8,'Estacion 1'!$D$3:$Q$198,5,0)","v":{"$error":"#N/A"}},{"$f":"VLOOKUP($B8,'Estacion 1'!$D$3:$Q$198,6,0)","v":{"$error":"#N/A"}},{"$f":"VLOOKUP($B8,'Estacion 1'!$D$3:$Q$198,7,0)","v":{"$error":"#N/A"}},{"$f":"VLOOKUP($B8,'Estacion 1'!$D$3:$Q$198,4,0)","v":{"$error":"#N/A"}},60]
[2,102,null,null,7,"20.00",7,0,89,0,89,"B","C","Z","B","Z","Z","A","B","Z","Z",{"$f":"VLOOKUP($B9,'Estacion 1'!$D$3:$Q$198,5,0)","v":{"$error":"#N/A"}},{"$f":"VLOOKUP($B9,'Estacion 1'!$D$3:$Q$198,6,0)","v":{"$error":"#N/A"}},{"$f":"VLOOKUP($B9,'Estacion 1'!$D$3:$Q$198,7,0)","v":{"$error":"#N/A"}},{"$f":"VLOOKUP($B9,'Estacion 1'!$D$3:$Q$198,4,0)","v":{"$error":"#N/A"}},0]

{"sheet":"Estacion 1","index":1,"n_rows":1,"n_cols":13,"rows_kept":1,"cut":false,"hidden":false,"merged":[]}
["Fecha_Hora","Dorsal","Estación","Dorsal","Nombre","Apellido","Tiempo","R1","R2","…","T1","T2","…"]

{"sheet":"Estacion 2","index":2,"n_rows":1,"n_cols":13,"rows_kept":1,"cut":false,"hidden":false,"merged":[]}
["Fecha_Hora","Dorsal","Estación","Dorsal","Nombre","Apellido","Tiempo","R1","R2","…","T1","T2","…"]

{"sheet":"Estacion 3","index":3,"n_rows":1,"n_cols":13,"rows_kept":1,"cut":false,"hidden":false,"merged":[]}
["Fecha_Hora","Dorsal","Estación","Dorsal","Nombre","Apellido","Tiempo","R1","R2","…","T1","T2","…"]

{"sheet":"Estacion 4","index":4,"n_rows":1,"n_cols":13,"rows_kept":1,"cut":false,"hidden":false,"merged":[]}
["Fecha_Hora","Dorsal","Estación","Dorsal","Nombre","Apellido","Tiempo","R1","R2","…","T1","T2","…"]

{"sheet":"Estacion 5","index":5,"n_rows":1,"n_cols":13,"rows_kept":1,"cut":false,"hidden":false,"merged":[]}
["Fecha_Hora","Dorsal","Estación","Dorsal","Nombre","Apellido","Tiempo","R1","R2","…","T1","T2","…"]

{"sheet":"Estacion 6","index":6,"n_rows":1,"n_cols":13,"rows_kept":1,"cut":false,"hidden":false,"merged":[]}
["Fecha_Hora","Dorsal","Estación","Dorsal","Nombre","Apellido","Tiempo","R1","R2","…","T1","T2","…"]

{"sheet":"Estacion 7","index":7,"n_rows":1,"n_cols":17,"rows_kept":1,"cut":false,"hidden":false,"merged":[]}
["Fecha y hora","Dorsal","Estacion","Dorsal","Nombre","Apellido","Tiempo","1 problema","2 problema","3 problema","4 problema","5 problema","1 tiempo","2 tiempo","3 tiempo","4 tiempo","5 tiempo"]

{"sheet":"Estacion 8","index":8,"n_rows":1,"n_cols":17,"rows_kept":1,"cut":false,"hidden":false,"merged":[]}
["Fecha y hora","Dorsal","Estacion","Dorsal","Nombre","Apellido","Tiempo","1 problema","2 problema","3 problema","4 problema","5 problema","1 tiempo","2 tiempo","3 tiempo","4 tiempo","5 tiempo"]

{"sheet":"ParamsANT","index":9,"n_rows":12,"n_cols":8,"rows_kept":12,"cut":false,"hidden":false,"merged":[]}
["Proxy"]
["Evento",3]
["Id. desde",0]
["Fecha desde","2019-03-07"]
["Hora desde","14:00:00"]
["Usuario","usuario"]
["Password","clave"]
["Frecuencia (min.)",0]
["Num. Estaciones",1]
["Desafíos x Estación"]
[1,2,3,4,5,6,7,8]
[2,0,0,0,0,0,0,0]